Hadden Industries Universal Core Ontology
type: Ontology
version IRI: https://haddenindustries.com/ontology/universal/core/20190730
imports: http://purl.org/dc/terms#2012
imports: http://www.w3.org/2006/time#2016
imports: https://haddenindustries.com/ontology/universal/reference-data/20190730
contributor: http://orcid.org/0000-0001-8017-8797
creator: http://orcid.org/0000-0001-8017-8797
publisher: Hadden Industries Ltd
created: 2016-09-30
description: Set of concepts and categories, applicable to almost all domains, that shows their properties and the relations between them
format: application/rdf+xml
language: eng
license: https://opensource.org/licenses/MIT
modified: 2019-07-30
rights: © 2019 Hadden Industries Ltd
subject: sh85094833
label: HaddenIndustriesUniversalCoreOntology
prior version: https://haddenindustries.com/ontology/universal/core/20190719

acronym
type: AnnotationProperty
range: token
type: DatatypeProperty
sub property of: alternative
creator: http://orcid.org/0000-0001-8017-8797
comment: Abbreviation formed from the initial letters of other words and pronounced as a word
created: 2017-05-02T09:42:54Z

synonym
type: AnnotationProperty
range: token
type: DatatypeProperty
sub property of: alternative
creator: http://orcid.org/0000-0001-8017-8797
comment: Word or phrase that means exactly or nearly the same as another word or phrase in the same language
created: 2016-10-20T08:30:07Z

hasActivity
type: ObjectProperty
domain: Activity Person Relationship
range: Activity
creator: http://orcid.org/0000-0001-8017-8797
created: 2019-07-29T12:54:10Z

hasPerson
type: ObjectProperty
domain: Activity Person Relationship
range: Person
creator: http://orcid.org/0000-0001-8017-8797
created: 2019-07-29T12:55:56Z

hasLocation
type: ObjectProperty
domain: Activity
range: Location
creator: http://orcid.org/0000-0001-8017-8797
created: 2019-05-09T07:37:17Z

hasOrganisation
type: ObjectProperty
domain: Activity
range: Organisation
creator: http://orcid.org/0000-0001-8017-8797
created: 2017-04-18T08:57:30Z

hasResource
type: ObjectProperty
domain: Activity
range: Resource
creator: http://orcid.org/0000-0001-8017-8797
created: 2017-04-25T11:24:29Z

hasProductOrService
type: ObjectProperty
domain: Brand
range: Product Or Service
creator: http://orcid.org/0000-0001-8017-8797
created: 2016-10-20T14:45:36Z

hasProductOrService
type: ObjectProperty
domain: Claim
range: Product Or Service
creator: http://orcid.org/0000-0001-8017-8797
created: 2017-01-16T13:42:06Z

hasProductOrService
type: ObjectProperty
domain: Complaint
range: Product Or Service
creator: http://orcid.org/0000-0001-8017-8797
created: 2016-12-19T12:56:25Z

hasProductOrServiceIndividual
type: ObjectProperty
domain: Contract
range: Product Or Service Individual
creator: http://orcid.org/0000-0001-8017-8797
created: 2016-10-24T11:05:44Z

hasLocation
type: ObjectProperty
domain: CountrySubdivision
range: Location
creator: http://orcid.org/0000-0001-8017-8797
created: 2017-04-13T10:52:01Z

hasLocation
type: ObjectProperty
domain: Country
range: Location
creator: http://orcid.org/0000-0001-8017-8797
created: 2017-04-13T10:50:54Z

hasDocumentToPersonRelationship
type: ObjectProperty
domain: Document
range: Document To Person Relationship
creator: http://orcid.org/0000-0001-8017-8797
created: 2018-11-19T12:36:09Z

hasLocation
type: ObjectProperty
domain: Document
range: Location
creator: http://orcid.org/0000-0001-8017-8797
created: 2017-03-14T15:53:52Z

hasDocument
type: ObjectProperty
domain: Event
range: Document
creator: http://orcid.org/0000-0001-8017-8797
created: 2018-08-10T15:08:22Z

hasLocation
type: ObjectProperty
domain: Event
range: Location
creator: http://orcid.org/0000-0001-8017-8797
created: 2016-12-19T12:18:36Z

hasObject
type: ObjectProperty
domain: Event
range: Object
creator: http://orcid.org/0000-0001-8017-8797
created: 2016-11-08T16:26:10Z

hasPerson
type: ObjectProperty
domain: Event
range: Person
creator: http://orcid.org/0000-0001-8017-8797
created: 2016-11-08T16:25:57Z

hasTime
type: ObjectProperty
domain: Event
range: Time
creator: http://orcid.org/0000-0001-8017-8797
created: 2018-08-10T18:32:02Z

hasLocation
type: ObjectProperty
domain: GeographicPostcode
range: Location
creator: http://orcid.org/0000-0001-8017-8797
created: 2017-04-12T19:04:25Z

hasLocation
type: ObjectProperty
domain: Hazard
range: Location
creator: http://orcid.org/0000-0001-8017-8797
created: 2017-04-10T09:29:38Z

hasContract
type: ObjectProperty
domain: Incidental Beneficiary
range: Contract
creator: http://orcid.org/0000-0001-8017-8797
created: 2017-07-03T12:27:35Z

hasContract
type: ObjectProperty
domain: Intended Beneficiary
range: Contract
creator: http://orcid.org/0000-0001-8017-8797
created: 2017-07-03T12:26:30Z

hasLocation
type: ObjectProperty
domain: Landline Number
range: Location
creator: http://orcid.org/0000-0001-8017-8797
created: 2017-01-23T09:56:34Z

hasLocation
type: ObjectProperty
domain: Location Time Interval
range: Location
creator: http://orcid.org/0000-0001-8017-8797
created: 2017-05-17T13:19:41Z

hasTimeInterval
type: ObjectProperty
domain: Location Time Interval
range: Time Interval
creator: http://orcid.org/0000-0001-8017-8797
created: 2017-07-03T08:43:58Z

hasAccessibleHours
type: ObjectProperty
domain: Location
range: Location Time Interval
creator: http://orcid.org/0000-0001-8017-8797
created: 2017-05-08T10:34:36Z

hasAddress
type: ObjectProperty
domain: Location
range: Address
creator: http://orcid.org/0000-0001-8017-8797
created: 2017-01-16T09:58:41Z

hasLocation
type: ObjectProperty
domain: Location
range: Location
creator: http://orcid.org/0000-0001-8017-8797
created: 2017-04-13T09:14:28Z
comment: Should be derived via spatial operators

hasDocument
type: ObjectProperty
domain: Object
range: Document
creator: http://orcid.org/0000-0001-8017-8797
created: 2017-01-23T10:08:35Z

hasLocation
type: ObjectProperty
domain: Object
range: Location
creator: http://orcid.org/0000-0001-8017-8797
created: 2017-04-13T10:19:34Z

hasObject
type: ObjectProperty
domain: Object
range: Object
creator: http://orcid.org/0000-0001-8017-8797
created: 2016-11-21T16:01:43Z

Object_hasQuantityValue
type: ObjectProperty
domain: Object
range: Quantity Value
creator: http://orcid.org/0000-0001-8017-8797
created: 2019-04-11T11:59:42Z

hasBrand
type: ObjectProperty
domain: Offering
range: Brand
creator: http://orcid.org/0000-0001-8017-8797
created: 2017-01-31T14:45:46Z

hasLocation
type: ObjectProperty
domain: Offering
range: Location
creator: http://orcid.org/0000-0001-8017-8797
created: 2017-04-24T13:34:09Z

hasProductOrService
type: ObjectProperty
domain: Offering
range: Product Or Service
creator: http://orcid.org/0000-0001-8017-8797
created: 2016-11-30T20:49:38Z

hasOffering
type: ObjectProperty
domain: Order
range: Offering
creator: http://orcid.org/0000-0001-8017-8797
created: 2016-10-24T10:13:38Z

hasActivity
type: ObjectProperty
domain: Organisation
range: Activity
creator: http://orcid.org/0000-0001-8017-8797
created: 2017-01-30T15:42:52Z

hasLocation
type: ObjectProperty
domain: Organisation
range: Location
creator: http://orcid.org/0000-0001-8017-8797
created: 2017-05-08T10:08:12Z

hasOrganisation
type: ObjectProperty
domain: Organisation
range: Organisation
creator: http://orcid.org/0000-0001-8017-8797
created: 2019-05-09T07:34:45Z

hasDocumentToPersonRelationship
type: ObjectProperty
domain: Person
range: Document To Person Relationship
creator: http://orcid.org/0000-0001-8017-8797
created: 2018-11-19T12:36:59Z

hasTask
type: ObjectProperty
domain: Plan
range: Task
creator: http://orcid.org/0000-0001-8017-8797
created: 2019-05-09T07:39:36Z

hasService
type: ObjectProperty
domain: Product Or Service Preference
range: Product Or Service
creator: http://orcid.org/0000-0001-8017-8797
created: 2016-10-18T13:51:30Z

hasProductOrService
type: ObjectProperty
domain: Product Or Service
range: Product Or Service
creator: http://orcid.org/0000-0001-8017-8797
created: 2017-05-17T13:35:35Z

hasLocation
type: ObjectProperty
domain: Route
range: Location
creator: http://orcid.org/0000-0001-8017-8797
created: 2017-04-24T13:14:17Z

hasActivity
type: ObjectProperty
domain: Task
range: Activity
creator: http://orcid.org/0000-0001-8017-8797
created: 2019-05-09T07:40:45Z

hasActivity
type: ObjectProperty
domain: Resource
range: Activity
creator: http://orcid.org/0000-0001-8017-8797
created: 2017-01-16T08:39:48Z

hasBasicPropertyUnit
type: ObjectProperty
domain: Title Deed
range: Basic Property Unit
creator: http://orcid.org/0000-0001-8017-8797
created: 2017-04-11T10:37:59Z

hasBrand
type: ObjectProperty
domain: Person
range: Brand
creator: http://orcid.org/0000-0001-8017-8797
created: 2016-10-20T14:41:41Z

hasClaim
type: ObjectProperty
domain: Payment
range: Claim
creator: http://orcid.org/0000-0001-8017-8797
created: 2016-12-19T13:20:13Z

hasComplaint
type: ObjectProperty
domain: Claim
range: Complaint
creator: http://orcid.org/0000-0001-8017-8797
created: 2017-01-16T13:59:35Z

hasContract
type: ObjectProperty
domain: Payment
range: Contract
creator: http://orcid.org/0000-0001-8017-8797
created: 2016-12-19T13:03:44Z

hasDocument
type: ObjectProperty
domain: Document
range: Document
creator: http://orcid.org/0000-0001-8017-8797
created: 2016-10-17T11:33:12Z

hasGeometry
type: ObjectProperty
domain: Location
range: Geometry
creator: http://orcid.org/0000-0001-8017-8797
created: 2017-01-25T10:57:04Z

hasIncidentalBeneficiary
type: ObjectProperty
domain: Contract
range: Incidental Beneficiary

hasIntendedBeneficiary
type: ObjectProperty
domain: Contract
range: Intended Beneficiary

hasLocation
type: ObjectProperty
domain: Address
range: Location

hasMachine
type: ObjectProperty
domain: Application
range: Machine
creator: http://orcid.org/0000-0001-8017-8797
created: 2016-11-28T16:17:37Z

hasMeasuredQuantityValue
type: ObjectProperty
domain: Measurement Result
range: Measured Quantity Value
creator: http://orcid.org/0000-0001-8017-8797
created: 2017-05-06T21:05:06Z

hasMeasurementMethod
type: ObjectProperty
domain: Measurement
range: MeasurementMethod
creator: http://orcid.org/0000-0001-8017-8797
created: 2017-05-06T21:25:38Z

hasMeasurementResult
type: ObjectProperty
domain: Measurement
range: Measurement Result
creator: http://orcid.org/0000-0001-8017-8797
created: 2017-05-06T21:03:58Z

hasMeasurementUnit
type: ObjectProperty
domain: Quantity Value
range: MeasurementUnit
creator: http://orcid.org/0000-0001-8017-8797
created: 2017-05-06T21:23:49Z

hasMessage
type: ObjectProperty
domain: Message Thread
range: Message
creator: http://orcid.org/0000-0001-8017-8797
created: 2016-12-19T13:44:13Z

hasNaturalPersonGender
type: ObjectProperty
domain: Natural Person
range: Natural Person Gender
creator: http://orcid.org/0000-0001-8017-8797
created: 2017-01-23T12:51:48Z

hasNaturalPersonTitle
type: ObjectProperty
domain: Natural Person
range: Natural Person Title
creator: http://orcid.org/0000-0001-8017-8797
created: 2017-01-23T11:53:01Z

hasPayment
type: ObjectProperty
domain: Person
range: Payment
creator: http://orcid.org/0000-0001-8017-8797
created: 2016-12-19T13:05:55Z

hasPerson
type: ObjectProperty
domain: Organisation
range: Person
creator: http://orcid.org/0000-0001-8017-8797
created: 2016-12-13T08:52:11Z

hasPersonIs
type: ObjectProperty
domain: Person Relationship
range: Person

hasPersonName
type: ObjectProperty
domain: Person
range: Person Name
creator: http://orcid.org/0000-0001-8017-8797
created: 2017-01-23T14:36:07Z

hasPersonNameSuffix
type: ObjectProperty
domain: Person
range: Person Name Suffix
creator: http://orcid.org/0000-0001-8017-8797
created: 2017-01-24T15:59:24Z

hasPersonOf
type: ObjectProperty
domain: Person Relationship
range: Person
creator: http://orcid.org/0000-0001-8017-8797

hasPrice
type: ObjectProperty
domain: Offering
range: Price
creator: http://orcid.org/0000-0001-8017-8797
created: 2016-11-30T10:05:27Z

hasProductOrService
type: ObjectProperty
domain: Product Or Service Individual
range: Product Or Service
creator: http://orcid.org/0000-0001-8017-8797
created: 2016-10-18T11:36:12Z

hasProductOrServiceIndividual
type: ObjectProperty
domain: Message
range: Product Or Service Individual
creator: http://orcid.org/0000-0001-8017-8797
created: 2016-10-17T15:08:40Z

hasQuantity
type: ObjectProperty
domain: Measurement
range: Quantity
creator: http://orcid.org/0000-0001-8017-8797
created: 2017-05-06T21:18:09Z

hasServicePreference
type: ObjectProperty
domain: Person
range: Product Or Service Preference
creator: http://orcid.org/0000-0001-8017-8797
created: 2016-10-18T13:51:18Z

hasSex
type: ObjectProperty
domain: Natural Person Gender
range: Sex
creator: http://orcid.org/0000-0001-8017-8797
created: 2017-06-02T08:26:55Z

hasSkill
type: ObjectProperty
domain: Person
range: Skill
creator: http://orcid.org/0000-0001-8017-8797
created: 2019-07-29T11:11:47Z

hasSpatialReferenceSystem
type: ObjectProperty
domain: Geometry
range: SpatialReferenceSystem
creator: http://orcid.org/0000-0001-8017-8797
created: 2017-05-10T20:38:23Z

hasTransactionTime
type: ObjectProperty
domain: Thing
range: Transaction Time

hasValidTime
type: ObjectProperty
domain: Thing
range: Valid Time

dateTime
type: DatatypeProperty
domain: Time Instant
range: dateTime

dateTimeEnd
type: DatatypeProperty
sub property of: topDataProperty
domain: Time Interval
range: dateTime

dateTimeStart
type: DatatypeProperty
sub property of: topDataProperty
domain: Time Interval
range: dateTime

Account
type: Class
subclass of: Product Or Service
creator: http://orcid.org/0000-0001-8017-8797
created: 2017-07-03T08:52:31Z
description: Product Or Service that is the arrangement for regular dealings with a business

Account Number
type: Class
subclass of: Product Or Service Individual Non-Material
creator: http://orcid.org/0000-0001-8017-8797
created: 2016-11-24T08:49:55Z
description: Product Or Service Individual of an Account
label: AccountNumber

Activity Person Relationship
type: Class
subclass of: Restriction
  on property: hasActivity
  some values from: Activity
subclass of: Restriction
  on property: hasPerson
  some values from: Person
creator: http://orcid.org/0000-0001-8017-8797
created: 2019-07-29T12:46:16Z
description: Association between an Activity and a Person
label: ActivityPersonRelationship

Address
type: Class
subclass of: Restriction
  on property: hasLocation
  min qualified cardinality: 0
  on class: Location
creator: http://orcid.org/0000-0001-8017-8797
created: 2016-09-30T12:00:00Z
description: Particulars of a place

Application
type: Class
subclass of: Product Or Service
subclass of: System
subclass of: Restriction
  on property: hasMachine
  some values from: Machine
creator: http://orcid.org/0000-0001-8017-8797
created: 2016-10-17T14:07:40Z
description: Software Product Or Service System designed to fulfil a particular purpose

Application Programming Interface
type: Class
subclass of: Product Or Service
creator: http://orcid.org/0000-0001-8017-8797
created: 2017-07-03T09:08:08Z
description: Set of subroutine definitions, protocols, and tools for building Applications
label: ApplicationProgrammingInterface
acronym: API

Area
type: Class
subclass of: Geometry
creator: http://orcid.org/0000-0001-8017-8797
created: 2017-01-16T09:09:40Z
description: Two-dimensional Geometry

Author
type: Class
subclass of: Document To Person Relationship
creator: http://orcid.org/0000-0001-8017-8797
created: 2019-05-09T13:10:10Z
description: Writer of a Document

Basic Property Unit
type: Class
subclass of: Location
creator: http://orcid.org/0000-0001-8017-8797
created: 2017-04-11T10:18:30Z
description: Basic unit of ownership that is recorded in the land books, land registers or equivalent. It is defined by unique ownership and homogeneous real property rights, and may consist of one or more adjacent or geographically separate parcels. In the United Kingdom, it is known as Basic Land and Property Unit, under BS 7666-2.
label: BasicPropertyUnit
acronym: BPU
synonym: Basic Land and Property Unit

Birth Certificate
type: Class
subclass of: Document
creator: http://orcid.org/0000-0001-8017-8797
created: 2017-01-23T11:39:47Z
description: Document confirming that a Natural Person was born
label: BirthCertificate

Brand
type: Class
subclass of: Restriction
  on property: hasProductOrService
  min qualified cardinality: 0
  on class: Product Or Service
creator: http://orcid.org/0000-0001-8017-8797
created: 2016-10-20T14:41:07Z
description: Identity associated with a set of Products Or Services

Building
type: Class
subclass of: Structure
creator: http://orcid.org/0000-0001-8017-8797
created: 2017-04-13T09:47:15Z
description: Structure with a roof and walls, such as a house or factory

Building Footprint
type: Class
subclass of: Location
creator: http://orcid.org/0000-0001-8017-8797
created: 2017-01-16T09:35:56Z
description: Location representing the Area of a Building where it meets the ground
label: BuildingFootprint

Claim
type: Class
subclass of: Document
subclass of: Restriction
  on property: hasProductOrService
  some values from: Product Or Service
subclass of: Restriction
  on property: hasComplaint
  min qualified cardinality: 0
  on class: Complaint
creator: http://orcid.org/0000-0001-8017-8797
created: 2017-01-16T13:31:24Z
description: Legal demand for compensation for a loss under a Contract

Complaint
type: Class
subclass of: Message Thread
subclass of: Restriction
  on property: hasProductOrService
  some values from: Product Or Service
creator: http://orcid.org/0000-0001-8017-8797
created: 2016-12-19T12:55:25Z
description: Message Thread in which a Person expresses dissatisfaction with a Product Or Service

Contract
type: Class
subclass of: Document
subclass of: Restriction
  on property: hasProductOrServiceIndividual
  min qualified cardinality: 0
  on class: Product Or Service Individual
subclass of: Restriction
  on property: hasIncidentalBeneficiary
  min qualified cardinality: 0
  on class: Incidental Beneficiary
subclass of: Restriction
  on property: hasIntendedBeneficiary
  min qualified cardinality: 0
  on class: Intended Beneficiary
creator: http://orcid.org/0000-0001-8017-8797
created: 2016-09-30T12:00:00Z
description: Agreement between Persons for the provision of Products Or Services, that is intended to be enforceable by law

Death Certificate
type: Class
subclass of: Document
creator: http://orcid.org/0000-0001-8017-8797
created: 2017-05-06T14:53:12Z
description: Document confirming that a Natural Person is deceased
label: DeathCertificate

Device
type: Class
subclass of: Machine
creator: http://orcid.org/0000-0001-8017-8797
created: 2016-10-14T12:00:00Z
description: Mechanical or electronic Machine that is typically portable

Document
type: Class
subclass of: Restriction
  on property: hasDocumentToPersonRelationship
  min qualified cardinality: 0
  on class: Document To Person Relationship
subclass of: Restriction
  on property: hasLocation
  min qualified cardinality: 0
  on class: Location
subclass of: Restriction
  on property: hasDocument
  min qualified cardinality: 0
  on class: Document
creator: http://orcid.org/0000-0001-8017-8797
created: 2016-10-14T12:00:00Z
description: Structured information that serves as an official record

Document To Person Relationship
type: Class
creator: http://orcid.org/0000-0001-8017-8797
created: 2018-11-19T12:12:24Z
description: Association between a Document and a Person
label: DocumentToPersonRelationship

Email Address
type: Class
subclass of: Product Or Service Individual Non-Material
creator: http://orcid.org/0000-0001-8017-8797
created: 2017-01-23T11:44:16Z
description: Product Or Service Individual of an Email Service
modified: 2019-05-09
label: EmailAddress
synonym: E-mail Address

Email Service
type: Class
subclass of: Product Or Service
creator: http://orcid.org/0000-0001-8017-8797
created: 2019-05-09T15:09:01Z
description: Product Or Service providing an electronic mail box
label: EmailService
synonym: E-Mail Service
synonym: Electronic Mail Service

Event
type: Class
subclass of: Restriction
  on property: hasTime
  some values from: Time
subclass of: Restriction
  on property: hasDocument
  min qualified cardinality: 0
  on class: Document
subclass of: Restriction
  on property: hasLocation
  min qualified cardinality: 0
  on class: Location
subclass of: Restriction
  on property: hasObject
  min qualified cardinality: 0
  on class: Object
subclass of: Restriction
  on property: hasPerson
  min qualified cardinality: 0
  on class: Person
creator: http://orcid.org/0000-0001-8017-8797
created: 2016-09-30T12:00:00Z
description: Occurrence, potentially involving Persons, Locations, Objects, or Documents

Fax Number
type: Class
subclass of: Landline Number
creator: http://orcid.org/0000-0001-8017-8797
created: 2017-01-23T09:54:41Z
description: Landline Number assigned to a Device capable of telephonically transmitting and receiving Documents
label: FaxNumber

Geometry
type: Class
subclass of: Restriction
  on property: hasSpatialReferenceSystem
  qualified cardinality: 1
  on class: SpatialReferenceSystem
creator: http://orcid.org/0000-0001-8017-8797
created: 2017-01-25T10:54:52Z
description: Spatial component of geographic features
comment: http://support.esri.com/other-resources/gis-dictionary/term/geometry

Hazard
type: Class
subclass of: Restriction
  on property: hasLocation
  some values from: Location
creator: http://orcid.org/0000-0001-8017-8797
created: 2017-01-16T10:05:14Z
description: Danger at a Location

Image
type: Class
subclass of: Document
creator: http://orcid.org/0000-0001-8017-8797
created: 2016-12-20T15:44:15Z
description: Visual representation of a thing

Incidental Beneficiary
type: Class
subclass of: Document To Person Relationship
subclass of: Restriction
  on property: hasContract
  qualified cardinality: 1
  on class: Contract
creator: http://orcid.org/0000-0001-8017-8797
created: 2016-10-19T09:22:30Z
description: Document To Person Relationship in which a Person unintentionally benefits from a Contract between a Promisor and Promisee
label: IncidentalBeneficiary

Incorporation Certificate
type: Class
subclass of: Document
creator: http://orcid.org/0000-0001-8017-8797
created: 2017-05-06T14:41:51Z
description: Legal Document relating to the formation of a Juridical Person
label: IncorporationCertificate

Intended Beneficiary
type: Class
subclass of: Document To Person Relationship
subclass of: Restriction
  on property: hasContract
  qualified cardinality: 1
  on class: Contract
creator: http://orcid.org/0000-0001-8017-8797
created: 2016-10-19T09:22:37Z
description: Document To Person Relationship in which a Person is neither a Promisor nor Promisee in a Contract, but stands to benefit from the Contract's performance by acquiring rights under it
label: IntendedBeneficiary

Internet Protocol Address
type: Class
subclass of: Product Or Service Individual Non-Material
creator: http://orcid.org/0000-0001-8017-8797
created: 2017-10-26T11:46:14Z
description: Product Or Service Individual of an Internet Protocol Address Assignment
label: InternetProtocolAddress
synonym: IP Address

Internet Protocol Address Assignment
type: Class
subclass of: Product Or Service
creator: http://orcid.org/0000-0001-8017-8797
created: 2017-10-26T11:51:41Z
description: Allocation of a numerical identifier to a Device connected to a computer network that uses the Internet Protocol for communication
label: InternetProtocolAddressAssignment
synonym: IP address assignment

Invoice
type: Class
subclass of: Document
creator: http://orcid.org/0000-0001-8017-8797
created: 2017-07-03T12:31:54Z
description: Document listing of provided Products Or Services, with a statement of the Payment due for these

Juridical Person
type: Class
subclass of: Person
disjoint with: Natural Person
creator: http://orcid.org/0000-0001-8017-8797
created: 2016-09-30T12:00:00Z
description: Entity, that is not a Natural Person, recognised by law as having exercisable rights and duties
label: JuridicalPerson
synonym: Company
synonym: Corporation
synonym: Firm
synonym: Organisation

Label
type: Class
subclass of: Object
creator: http://orcid.org/0000-0001-8017-8797
created: 2017-01-24T11:18:35Z
description: Object attached to another Object that it gives information about

Landline Number
type: Class
subclass of: Telephone Number
subclass of: Restriction
  on property: hasLocation
  qualified cardinality: 1
  on class: Location
disjoint with: Mobile Number
creator: http://orcid.org/0000-0001-8017-8797
created: 2017-01-23T09:53:50Z
description: Telephone Number assigned to a fixed-line telephone subscriber station
label: LandlineNumber

Line
type: Class
subclass of: Geometry
creator: http://orcid.org/0000-0001-8017-8797
created: 2017-04-13T09:24:11Z
description: One-dimensional Geometry

Location
type: Class
subclass of: Restriction
  on property: hasGeometry
  some values from: Geometry
subclass of: Restriction
  on property: hasAccessibleHours
  min qualified cardinality: 0
  on class: Opening Hours
subclass of: Restriction
  on property: hasAddress
  min qualified cardinality: 0
  on class: Address
subclass of: Restriction
  on property: hasLocation
  min qualified cardinality: 0
  on class: Location
creator: http://orcid.org/0000-0001-8017-8797
created: 2016-11-10T12:00:00Z
description: Particular place that can be described by a Geometry in a Spatial Reference System

Location Time Interval
type: Class
subclass of: Restriction
  on property: hasLocation
  some values from: Location
subclass of: Restriction
  on property: hasTimeInterval
  some values from: Time Interval
creator: http://orcid.org/0000-0001-8017-8797
created: 2017-05-08T10:43:28Z
description: Time Interval associated to a Location
label: LocationTimeInterval

Machine
type: Class
subclass of: Structure
creator: http://orcid.org/0000-0001-8017-8797
created: 2016-10-14T12:00:00Z
description: Structure that uses energy to perform an intended action

Marriage Certificate
type: Class
subclass of: Document
creator: http://orcid.org/0000-0001-8017-8797
created: 2017-05-06T14:58:40Z
description: Document confirming the legally or formally recognised union of Natural Persons as partners in a personal relationship
label: MarriageCertificate

Measured Quantity Value
type: Class
subclass of: Quantity Value
creator: http://orcid.org/0000-0001-8017-8797
created: 2017-05-04T13:42:19Z
description: Quantity Value representing a Measurement Result
comment: NOTE 1 For a measurement involving replicate indications, each indication can be used to provide a corresponding measured quantity value. This set of individual measured quantity values can be used to calculate a resulting measured quantity value, such as an average or median, usually with a decreased associated measurement uncertainty. NOTE 2 When the range of the true quantity values believed to represent the measurand is small compared with the measurement uncertainty, a measured quantity value can be considered to be an estimate of an essentially unique true quantity value and is often an average or median of individual measured quantity values obtained through replicate measurements. NOTE 3 In the case where the range of the true quantity values believed to represent the measurand is not small compared with the measurement uncertainty, a measured quantity value is often an estimate of an average or median of the set of true quantity values. NOTE 4 In the GUM, the terms “result of measurement” and “estimate of the value of the measurand” or just “estimate of the measurand” are used for ‘measured quantity value’.
label: MeasuredQuantityValue
synonym: Measured value
synonym: Value of a measured quantity

Measurement
type: Class
subclass of: Event
subclass of: Restriction
  on property: hasMeasurementResult
  some values from: Measurement Result
subclass of: Restriction
  on property: hasQuantity
  some values from: Quantity
subclass of: Restriction
  on property: hasMeasurementMethod
  max qualified cardinality: 1
  on class: MeasurementMethod
creator: http://orcid.org/0000-0001-8017-8797
created: 2017-05-02T10:54:03Z
description: Process of experimentally obtaining one or more Quantity Values that can reasonably be attributed to a Quantity
comment: NOTE 1 Measurement does not apply to nominal properties. NOTE 2 Measurement implies comparison of quantities or counting of entities. NOTE 3 Measurement presupposes a description of the quantity commensurate with the intended use of a measurement result, a measurement procedure, and a calibrated measuring system operating according to the specified measurement procedure, including the measurement conditions.

Measurement Result
type: Class
subclass of: Restriction
  on property: hasMeasuredQuantityValue
  some values from: Measured Quantity Value
creator: http://orcid.org/0000-0001-8017-8797
created: 2017-05-06T21:01:25Z
description: Set of Quantity Values being attributed to a measurand together with any other available relevant information
comment: NOTE 1 A measurement result generally contains “relevant information” about the set of quantity values, such that some may be more representative of the measurand than others. This may be expressed in the form of a probability density function (PDF). NOTE 2 A measurement result is generally expressed as a single measured quantity value and a measurement uncertainty. If the measurement uncertainty is considered to be negligible for some purpose, the measurement result may be expressed as a single measured quantity value. In many fields, this is the common way of expressing a measurement result. NOTE 3 In the traditional literature and in the previous edition of the VIM, measurement result was defined as a value attributed to a measurand and explained to mean an indication, or an uncorrected result, or a corrected result, according to the context.
label: MeasurementResult
synonym: Result of measurement

Measuring Instrument
type: Class
subclass of: Machine
creator: http://orcid.org/0000-0001-8017-8797
created: 2017-05-04T14:32:43Z
description: Device used for making Measurements, alone or in conjunction with one or more supplementary devices
comment: 1. A measuring instrument that can be used alone is a measuring system. 2. A measuring instrument may be an indicating measuring instrument or a material measure.
label: MeasuringInstrument

Measuring System
type: Class
subclass of: Machine
creator: http://orcid.org/0000-0001-8017-8797
created: 2017-05-04T14:38:51Z
description: Set of one or more Measuring Instruments and often other devices, including any reagent and supply, assembled and adapted to give information used to generate measured Quantity Values within specified intervals for Quantities of specified Kinds
comment: A measuring system may consist of only one measuring instrument.
label: MeasuringSystem

Message
type: Class
subclass of: Event
subclass of: Restriction
  on property: hasProductOrServiceIndividual
  min qualified cardinality: 2
  on class: Product Or Service Individual
creator: http://orcid.org/0000-0001-8017-8797
created: 2016-10-14T12:00:00Z
description: Event of information transmission between Product Or Service Individuals

Message Thread
type: Class
subclass of: Restriction
  on property: hasMessage
  some values from: Message
creator: http://orcid.org/0000-0001-8017-8797
created: 2016-12-19T13:39:48Z
description: Set of Messages that has a common theme
label: MessageThread

Mobile Number
type: Class
subclass of: Telephone Number
creator: http://orcid.org/0000-0001-8017-8797
created: 2017-01-23T09:55:50Z
description: Telephone Number assigned to a wireless electronic telephony Device
label: MobileNumber

Natural Person
type: Class
subclass of: Object
subclass of: Person
subclass of: Restriction
  on property: hasNaturalPersonGender
  some values from: Natural Person Gender
subclass of: Restriction
  on property: hasNaturalPersonTitle
  min qualified cardinality: 0
  on class: Natural Person Title
creator: http://orcid.org/0000-0001-8017-8797
created: 2016-09-30T12:00:00Z
description: Individual human being
label: NaturalPerson
synonym: Human
synonym: Individual

Natural Person Gender
type: Class
subclass of: Restriction
  on property: hasSex
  qualified cardinality: 1
  on class: Sex
creator: http://orcid.org/0000-0001-8017-8797
created: 2017-01-23T11:57:47Z
description: Natural Person's identification of self as male, female, or neither
label: NaturalPersonGender

Natural Person Title
type: Class
creator: http://orcid.org/0000-0001-8017-8797
created: 2017-01-23T11:51:03Z
description: Prefix added to a Natural Person's name in certain contexts
label: NaturalPersonTitle

Nonbuilding Structure
type: Class
subclass of: Structure
creator: http://orcid.org/0000-0001-8017-8797
created: 2017-04-13T09:46:19Z
description: Structure not designed for continuous human occupancy
label: NonbuildingStructure

Notification
type: Class
subclass of: Message
creator: http://orcid.org/0000-0001-8017-8797
created: 2017-07-03T13:12:57Z
description: Message informing of something, typically in a formal or official manner

Object
type: Class
subclass of: Restriction
  on property: hasDocument
  min qualified cardinality: 0
  on class: Document
subclass of: Restriction
  on property: hasObject
  min qualified cardinality: 0
  on class: Object
subclass of: Restriction
  on property: hasLocation
  qualified cardinality: 1
  on class: Location
creator: http://orcid.org/0000-0001-8017-8797
created: 2016-10-17T12:00:00Z
description: Material thing

Offering
type: Class
subclass of: Restriction
  on property: hasProductOrService
  some values from: Product Or Service
subclass of: Restriction
  on property: hasPrice
  some values from: Price
subclass of: Restriction
  on property: hasLocation
  min qualified cardinality: 0
  on class: Location
subclass of: Restriction
  on property: hasBrand
  qualified cardinality: 1
  on class: Brand
creator: http://orcid.org/0000-0001-8017-8797
created: 2016-10-24T10:04:25Z
description: Request to make an offer to Contract for the provision of Products Or Services
synonym: Invitation To Treat
synonym: Proposition

Opening Hours
type: Class
subclass of: Location Time Interval
creator: http://orcid.org/0000-0001-8017-8797
created: 2017-05-08T10:33:13Z
description: Loction Time Interval when customers can browse Offerings
label: OpeningHours

Order
type: Class
subclass of: Document
subclass of: Restriction
  on property: hasOffering
  some values from: Offering
creator: http://orcid.org/0000-0001-8017-8797
created: 2016-10-14T12:00:00Z
description: Person's request for the supply of an Offering
comment: Expression of willingness to Contract on certain terms, made with the intention that it shall become binding as soon as it is accepted by the Person to whom it is addressed

Organisation
type: Class
subclass of: Restriction
  on property: hasPerson
  some values from: Person
subclass of: Restriction
  on property: hasActivity
  min qualified cardinality: 0
  on class: Activity
subclass of: Restriction
  on property: hasLocation
  min qualified cardinality: 0
  on class: Location
subclass of: Restriction
  on property: hasOrganisation
  min qualified cardinality: 0
  on class: Organisation
creator: http://orcid.org/0000-0001-8017-8797
created: 2016-11-28T16:35:44Z
description: Set of Persons with a purpose, that has no legal recognition of exercisable rights and duties

Payment
type: Class
subclass of: Event
subclass of: Restriction
  on property: hasClaim
  min qualified cardinality: 0
  on class: Claim
subclass of: Restriction
  on property: hasContract
  qualified cardinality: 1
  on class: Contract
creator: http://orcid.org/0000-0001-8017-8797
created: 2016-12-19T13:00:00Z
description: Event when a remuneration occurs for the provision of some Product Or Service under a Contract

Axiom
annotated source: Payment
annotated property: subClassOf
annotated target: Restriction
  on property: hasClaim
  min qualified cardinality: 0
  on class: Claim
deprecated: true

Axiom
annotated source: Payment
annotated property: subClassOf
annotated target: Restriction
  on property: hasContract
  qualified cardinality: 1
  on class: Contract
deprecated: true

Person
type: Class
subclass of: Restriction
  on property: hasBrand
  some values from: Brand
subclass of: Restriction
  on property: hasPersonName
  some values from: Person Name
subclass of: Restriction
  on property: hasDocumentToPersonRelationship
  min qualified cardinality: 0
  on class: Document To Person Relationship
subclass of: Restriction
  on property: hasPayment
  min qualified cardinality: 0
  on class: Payment
subclass of: Restriction
  on property: hasPersonNameSuffix
  min qualified cardinality: 0
  on class: Person Name Suffix
subclass of: Restriction
  on property: hasServicePreference
  min qualified cardinality: 0
  on class: Product Or Service Preference
subclass of: Restriction
  on property: hasSkill
  min qualified cardinality: 0
  on class: Skill
creator: http://orcid.org/0000-0001-8017-8797
created: 2016-09-30T12:00:00Z
description: Human being or entity recognised by law as having exercisable rights and duties

Person Name
type: Class
creator: http://orcid.org/0000-0001-8017-8797
created: 2017-01-23T14:33:42Z
description: Set of words by which a Person is designated, called, or known
label: PersonName

Person Name Suffix
type: Class
creator: http://orcid.org/0000-0001-8017-8797
created: 2017-01-24T15:55:24Z
description: Set of letters added to the end of a Person's Name in certain contexts
label: PersonNameSuffix

Person Relationship
type: Class
subclass of: Restriction
  on property: hasPersonIs
  qualified cardinality: 1
  on class: Person
subclass of: Restriction
  on property: hasPersonOf
  qualified cardinality: 1
  on class: Person
creator: http://orcid.org/0000-0001-8017-8797
created: 2016-10-14T12:00:00Z
description: Way in which Persons are connected
label: PersonRelationship

Plan
type: Class
subclass of: Document
subclass of: Restriction
  on property: hasTask
  min qualified cardinality: 0
  on class: Task
creator: http://orcid.org/0000-0001-8017-8797
created: 2016-10-14T12:00:00Z
description: Detailed proposal for doing or achieving something
modified: 2019-05-09
synonym: Campaign

Point
type: Class
subclass of: Geometry
creator: http://orcid.org/0000-0001-8017-8797
created: 2017-01-16T09:22:39Z
description: Zero-dimensional Geometry

Price
type: Class
creator: http://orcid.org/0000-0001-8017-8797
created: 2016-11-30T10:04:57Z
description: Compensation required for providing an Offering

Product Or Service
type: Class
subclass of: Restriction
  on property: hasProductOrService
  min qualified cardinality: 0
  on class: Product Or Service
creator: http://orcid.org/0000-0001-8017-8797
created: 2016-10-14T12:00:00Z
description: Utility offered to Persons
label: ProductOrService

Product Or Service Individual
type: Class
subclass of: Restriction
  on property: hasProductOrService
  qualified cardinality: 1
  on class: Product Or Service
creator: http://orcid.org/0000-0001-8017-8797
created: 2016-10-17T15:08:21Z
description: Single instance of a Product Or Service provided under a Contract
label: ProductOrServiceIndividual

Product Or Service Individual Non-Material
type: Class
subclass of: Product Or Service Individual
disjoint with: Product Or Service Individual Object
creator: http://orcid.org/0000-0001-8017-8797
created: 2017-05-02T07:30:05Z
description: Product Or Service Individual not consisting of physical Objects
label: ProductOrServiceIndividualNonMaterial

Product Or Service Individual Object
type: Class
subclass of: Object
subclass of: Product Or Service Individual
creator: http://orcid.org/0000-0001-8017-8797
created: 2017-05-02T07:20:44Z
description: Product Or Service Individual consisting of physical Objects
label: ProductOrServiceIndividualObject
synonym: Good

Product Or Service Preference
type: Class
subclass of: Restriction
  on property: hasService
  qualified cardinality: 1
  on class: Product Or Service
creator: http://orcid.org/0000-0001-8017-8797
created: 2016-10-18T13:50:48Z
description: Person's expressed choice of configuration of a Product Or Service
label: ProductOrServicePreference

Product Or Service Suspension
type: Class
subclass of: Event
creator: http://orcid.org/0000-0001-8017-8797
created: 2017-07-03T08:14:08Z
description: Event describing the temporary halt of the provisioning of Products Or Services
label: ProductOrServiceSuspension

Promisee
type: Class
subclass of: Document To Person Relationship
creator: http://orcid.org/0000-0001-8017-8797
created: 2018-11-19T12:22:57Z
description: Document To Person Relationship in which a Person is the recipient of a Contract received from the Promisor
synonym: Creditor
synonym: Obligee

Promisor
type: Class
subclass of: Document To Person Relationship
creator: http://orcid.org/0000-0001-8017-8797
created: 2018-11-19T12:23:12Z
description: Document To Person Relationship in which a Person becomes obliged through a Contract towards another
synonym: Debtor
synonym: Obligor

Qualification
type: Class
subclass of: Document
creator: http://orcid.org/0000-0001-8017-8797
created: 2016-12-20T13:58:45Z
description: Document awarded on the successful completion of a course of training or passing of an exam

Quantity Value
type: Class
subclass of: Restriction
  on property: hasMeasurementUnit
  min qualified cardinality: 0
  on class: MeasurementUnit
creator: http://orcid.org/0000-0001-8017-8797
created: 2017-05-04T13:43:44Z
description: Number and reference together expressing magnitude of a Quantity
comment: EXAMPLE 1 Length of a given rod: 5.34 m or 534 cm EXAMPLE 2 Mass of a given body: 0.152 kg or 152 g EXAMPLE 3 Curvature of a given arc: 112 m1 EXAMPLE 4 Celsius temperature of a given sample: 5 °C EXAMPLE 5 Electric impedance of a given circuit element at a given frequency, where j is the imaginary unit: (7  3j)  EXAMPLE 6 Refractive index of a given sample of glass: 1.32 EXAMPLE 7 Rockwell C hardness of a given sample: 43.5 HRC EXAMPLE 8 Mass fraction of cadmium in a given sample of copper: 3 μg/kg or 3  10−9 EXAMPLE 9 Molality of Pb2+ in a given sample of water: 1.76 μmol/kg EXAMPLE 10 Arbitrary amount-of-substance concentration of lutropin in a given sample of human blood plasma (WHO International Standard 80/552 used as a calibrator): 5.0 IU/l, where “IU” stands for “WHO International Unit” NOTE 1 According to the type of reference, a quantity value is either — a product of a number and a measurement unit (see Examples 1, 2, 3, 4, 5, 8 and 9); the measurement unit one is generally not indicated for quantities of dimension one (see Examples 6 and 8), or — a number and a reference to a measurement procedure (see Example 7), or — a number and a reference material (see Example 10). NOTE 2 The number can be complex (see Example 5). NOTE 3 A quantity value can be presented in more than one way (see Examples 1, 2 and 8). NOTE 4 In the case of vector or tensor quantities, each component has a quantity value. EXAMPLE Force acting on a given particle, e.g. in Cartesian components (Fx; Fy; Fz) = (31.5; 43.2; 17.0) N.
label: QuantityValue
synonym: Dimension
synonym: Value
synonym: Value of a quantity

Quotation
type: Class
subclass of: Document
creator: http://orcid.org/0000-0001-8017-8797
created: 2018-10-26T07:40:25Z
description: Formal statement setting out the estimated cost for a particular Offering
synonym: Quote

Refund
type: Class
subclass of: Payment
creator: http://orcid.org/0000-0001-8017-8797
created: 2017-07-03T14:20:10Z
description: Person-reversed Payment that arises because of a Complaint

Resource
type: Class
subclass of: Restriction
  on property: hasActivity
  min qualified cardinality: 0
  on class: Activity
creator: http://orcid.org/0000-0001-8017-8797
created: 2016-10-14T12:00:00Z
description: Thing required to carry out an Activity

Route
type: Class
subclass of: Restriction
  on property: hasLocation
  some values from: Location
creator: http://orcid.org/0000-0001-8017-8797
created: 2016-10-14T12:00:00Z
description: Totally ordered set of Locations

Structure
type: Class
subclass of: Object
creator: http://orcid.org/0000-0001-8017-8797
created: 2017-04-13T09:44:40Z
description: Built arrangement of Objects

System
type: Class
creator: http://orcid.org/0000-0001-8017-8797
created: 2016-10-14T12:00:00Z
description: Organised set of things, which act cohesively to bring about a result

Task
type: Class
subclass of: Restriction
  on property: hasActivity
  some values from: Activity
creator: http://orcid.org/0000-0001-8017-8797
created: 2019-05-09T07:39:02Z
description: Piece of work to be done or undertaken in a Plan
synonym: Plan Activity

Telephone Number
type: Class
subclass of: Product Or Service Individual Non-Material
creator: http://orcid.org/0000-0001-8017-8797
created: 2017-01-23T09:52:45Z
description: Product Or Service Individual of a Telephony Service
modified: 2019-05-09
label: TelephoneNumber

Telephony Service
type: Class
subclass of: Product Or Service
creator: http://orcid.org/0000-0001-8017-8797
created: 2019-05-09T15:13:31Z
description: Product Or Service providing use of a System for transmitting voices over a distance using wire or radio, by converting acoustic vibrations to electrical signals
label: TelephonyService

Time
type: Class
creator: http://orcid.org/0000-0001-8017-8797
created: 2016-10-14T12:00:00Z
description: Measure applied to the order in which events happen, and the duration of the events, or periods between the events

Time Duration
type: Class
creator: http://orcid.org/0000-0001-8017-8797
created: 2017-01-16T15:22:17Z
description: Length of Time that something exists or lasts
label: TimeDuration

Time Instant
type: Class
subclass of: Time
subclass of: Restriction
  on property: dateTime
  qualified cardinality: 1
  on data range: dateTime
disjoint with: Time Interval
creator: http://orcid.org/0000-0001-8017-8797
created: 2016-10-14T12:00:00Z
description: Point in Time at which some statement is true
label: TimeInstant
synonym: Point In Time
synonym: Time Point

Time Interval
type: Class
subclass of: Time
subclass of: Restriction
  on property: dateTimeEnd
  max qualified cardinality: 1
  on data range: dateTime
subclass of: Restriction
  on property: dateTimeStart
  max qualified cardinality: 1
  on data range: dateTime
creator: http://orcid.org/0000-0001-8017-8797
created: 2016-10-14T12:00:00Z
description: Time during which some statement is true
label: TimeInterval

Title Deed
type: Class
subclass of: Document
subclass of: Restriction
  on property: hasBasicPropertyUnit
  some values from: Basic Property Unit
creator: http://orcid.org/0000-0001-8017-8797
created: 2017-01-31T09:49:32Z
description: Document evidencing a Person's legal ownership of property
label: TitleDeed

Transaction Time
type: Class
subclass of: Time Interval
disjoint with: Valid Time
creator: http://orcid.org/0000-0001-8017-8797
created: 2016-10-14T12:00:00Z
description: Time Interval during which a statement is held in a data store
label: TransactionTime

Valid Time
type: Class
subclass of: Time Interval
creator: http://orcid.org/0000-0001-8017-8797
created: 2016-09-30T12:00:00Z
description: Time Interval during which a statement is true in the modelled reality
label: ValidTime

Vehicle
type: Class
subclass of: Machine
creator: http://orcid.org/0000-0001-8017-8797
created: 2016-10-14T12:00:00Z
description: Machine used to transport Objects

Volume
type: Class
subclass of: Geometry
creator: http://orcid.org/0000-0001-8017-8797
created: 2017-04-13T09:33:36Z
description: Three-dimensional Geometry

Activity
subclass of: Restriction
  on property: hasLocation
  min qualified cardinality: 0
  on class: Location
subclass of: Restriction
  on property: hasOrganisation
  min qualified cardinality: 0
  on class: Organisation
subclass of: Restriction
  on property: hasResource
  min qualified cardinality: 0
  on class: Resource